{"text_format":"1","workbook":"xlsx","n_sheets":7,"sheets":["Lathund","Projektinformation","Förenklad klimatkalkyl","Arbetsmoment arbetsplatsen","Resultat","Resultat per materialtyp","Standardvärden"],"not_rendered":{"charts":15,"images":1,"macros":1,"external_links":0,"defined_names":3,"comments":0,"pivot_tables":14},"unopened":[],"bounds":{"document_bytes":16777216,"sheet_cells":100000,"rows_first":2000,"rows_last":500,"rows_between":2000,"halvings":0,"cell_chars":16384,"cell_head_chars":4096},"cells_cut":0,"cells_raw":0,"read":"whole","date_system":"1900"}

{"sheet":"Lathund","index":0,"n_rows":1,"n_cols":1,"rows_kept":1,"cut":false,"hidden":false,"merged":[[0,0,64,0]]}
["\nPrincipen för ifyllnad av excelen är enkel. Gröna flikar och fält fylls i, Röda flikar och fält är resultat. Gula flikar och ofärgade fält är data som inte bör ändras. När dokumentet öppnas behöver Macron aktiveras eftersom det används för att uppdatera pivottabeller och diagram i resultatflikarna. Dessa går även att uppdatera manuellt genom att trycka Alt+F5.\n\nBörja med att fylla i flliken Projektinformation.\n\nFyll i namn på projektet, vilket skede projektet är i (under projektering eller under produktion) samt vilket byggår projektet har (detta måste fyllas i för att för att beräkning av gemensamma miljökrav ska göras). Om en procentuellt reduktionskrav på minskad klimatpåverkan har ställts på projektet så redovisas det under \"krav minskad klimatpåverkan\" vilket sedan kan jämföras med resultatet av kalkylen under \"minskad klimatpåverkan enl. kalkyl\".\n\nI rutan underlag mängder anges vilket underlag som använts för mängder till klimatkalkylen. Investeringskostnad och prisnivå samt en kort beskrivning av åtgärder görs också. I rutan Klimatpåverkan per investerad kr (kg CO2ekv / kr). Gemensamma miljökrav redovisas den klimatpåverkan som uppstår till följd av projektet per investerad krona.\n\nDärefter går man vidare till fliken Förenklad klimatkalkyl. Börja med att fylla i mängder i vänsta delen av kalkylbladet för de material som är aktuella. För betong finns 3 st variationer på Hållfasthetsklasser och exponeringsklasser.\u000b- Betong Generellt värde (Hållfasthetsklass C35/45 samt exponeringsklass XD3, XS3 och XF4)\n- Betong (Hållfasthetsklass C40/50 samt exponeringsklass XD3)\n- Betong (HållfasthetsklassC32/40 samt exponeringsklass XD2, XS2 och XF2)\n\nFör anläggningssten finns 5 olika alternativ på material samt möjligheter att ändra enhet på smågatsten och storgatsten mellan m och m2. Dimensioner för varje post under anläggningssten finns redovisas och bygger på standarddimensioner i Göteborgs stads teknisk handbok.\n\nFör asfalt finns möjligheten att ange tjocklek på den asfalt som används tillsammans med vilken area som ska asfalteras. Standardtjocklek framgår på de olika asfaltstyperna.\n\nFör posterna Berg- och jordmassor så finns det poster för schakt och fyll samt om massorna klassas som Fall A (massor som återanvänds inom projektet) eller Fall B (massor som köps in eller körs iväg utanför projektet). Emmissionsfaktorerna som fylls i är de som rör inköp av dom \"tillverkade\" massorna dvs. Berg fall B , fyll och Jord fall B, fyll. Som emissionsfaktor för Berschakt fall A och fall B avses tillverkning av sprängmedel. Transportavstånd som fylls i fliken Förenklad klimatkalkyl gäller för bergschakt och avståndet som ska fyllas i är det mellan fabriken där sprängmedel hämtas från och byggarbetsplatsen. Transportavstånd som rör hanteringen av massorna anges i fliken arbetsmoment arbetsplatsen.\n\nOm beläggning av grus används så kan posten Berg fall B, fyll användas för att beräkna klimatpåverkan.\n\nNär alla relevanta mängder är ifyllda så finns ett resultat för Referenskalkylen och för kalkylen Gemensamma miljökrav för det årtal som angivits i fliken projektinformation.\n\nNästa moment blir att justera i tjockleck, mängder, emissionsfaktorer och transportavstånd för det klimatförbättrade alternativet. Som utgångspunkt hämtas tjocklek, mängder, emissionsfaktorer och transportavstånd från data i referenskalkylen eller gemensamma miljökrav.\n\nOm val i projekteringen har inneburit att mängder eller tjocklek minskat så ska detta fyllas i för det klimatförbättrade alternativet.\n\nEmissionsfaktor för ett klimatförbättrat material kan fyllas i. För att hitta alternativa material kan EPD eftersökas i databaser för epd:er. Några exempel på databaser:\n- www.environdec.com/library\n- https://klimatkalkyl.trafikverket.se/Verification, Databas över EPD:er som godkänts för användning i Trafikverkets projekt.\n\nTransportavstånd kan justeras genom att studera hur långt det är mellan fabrik där materialet tillverkas och byggarbetsplatsen.\n\nOm återbrukat material används så räknas emissionsfaktorn och transportavståndet ut manuellt baserat på andelen återbrukat material. Om hela posten består av återbrukat material kan emissionsfaktorn sättas till ett väldigt lågt värde exempelvis 0,0000001 (detta eftersom ett värde emissionsfaktorn behövs för att kunna beräkna klimatpåverkan) och transportavstånd sätts till det avstånd som materialet har transporterats mellan lagringsplats och byggarbetsplatsen. Om det i det återbrukande materialet ingår någon form av förädling, lagerhållning eller behandling av produkten så ska en emissionsfaktor A1-A3 anges som speglar momentet. Som exempel kan en åtebrukad smågatsten behöva lagerhållas och ytbehandlas innan den används på nytt på arbetsplatsen. Då görs en bedömning av hur stor andel av emissionsfaktorn för jungfrulig smågatsten som en sådan lagerhållning och ytbehandling bedöms innebära.\n\nOm en viss andel material har återbrukats så kan detta räknas enligt följande beräkningsexempel:\nFör en byggarbetsplats så har 70 % av smågatstenen återbrukats. I referensalternativet har 1000 m smågatsten angivits  i cellen för mängder. I mängdcellen för det klimatförbättrade alternativet anges 1000 eftersom inte själva mängden smågatsten har förändrats. Emissionsfaktorn för det klimatförbättrade alternativet beräknas med hjälp av formeln =(andel ej återbrukad smågatsten*emissionsfaktor) dvs. (0,3*0,05). Även transportavståndet har förändrats eftersom det för 70% av materialet inte behöver transporteras från fabriken till byggarbetsplatsen utan  från en lagringsplats till byggaretsplatsen. I räkneexemplet är lagringsplatsen på ett avstånd av 5 km från byggarbetsplatsen och avståndet mellan fabrik och byggarbetsplatsen bedöms schablonmässigt vara samma avstånd som tidigare alltså 440 km. Detta innebär att även transportavståndet justeras manuellt enligt följande formel =((andel återbrukat material*transportavstånd lagringsplats till byggarbetsplats)+(andel ej återbrukat material*transportavstånd fabrik till byggarbetsplats) dvs. =((0,7*5)+(0,3*440)).\n\nNär mängder, emissionsfaktorer och manuellt beräknad återbrukning har fyllts i för det klimatförbättrade alternativet så går användaren vidare till fliken arbetsmoment arbetsplatsen. I denna flik kan användaren justera vilka drivmedel för det klimatförbättrade alternativet som ska användas. Som defaultvärde är gemensamma miljökrav ifyllt. Om exempelvis en helelektrifierad entreprenad är aktuell kan användaren i rullistan välja El (ursprungsmärkt förnybar) för aktuella arbetsmoment på arbetsplatsen. Om en egen emissionsfaktor vill användas (exempelvis om man vill använda 50% EL och 50% HVO100) så finns det möjlighet att fylla i en \"egen emissionsfaktor\". Enligt exemplet så beräknas då en ny emissionsfaktor med 50% El och 50% HVO till ((0,5*0,39)+(0,5*0,04)). Här finns även möjlighet att justera både transportlängder och drivmedel för masstransporter av både fall A och fall B. \n\nNär användaren har arbetat igenom denna arbetsgång så finns resultat beräknade i flikarna \"resultat\" och \"resultat per material\". Dessa resultat kan med fördel användas i \"PM reducerad klimatpåverkan\" för att illustrera resultatet av arbetet med minskad klimatpåverkan eller visa vilka material som har högst klimatpåverkan i aktuellt projekt. I fliken resultat presenteras de övergripande resultaten för hela projektet med cirkeldiagram för vilka material som ger upphov till störst klimatpåverkan. Cirkeldiagramen presenteras uppdelat på referenskalkylen, med gemensamma miljökrav och klimatförbättrat alternativ. I denna flik finns även ett stapeldiagram med jämförelse mellan vilka olika material som ger upphov till högst klimatpåverkan för alla 3 beräkningar.\n\nI fliken Resultat per material kan användaren fördjupa sin analys av hur mycket klimatpåverkan har minskat för olika materialtyper.\n\nI fliken Standardvärden finns värden som är standard och inte ska ändras. Exempel på värden som finns här är olika omvandlingsfaktorer, densitet och transportparametrar."]

{"sheet":"Projektinformation","index":1,"n_rows":12,"n_cols":3,"rows_kept":12,"cut":false,"hidden":false,"merged":[[11,2,16,2]]}
[]
[null,"Namn projekt"]
[null,"Skede"]
[null,"Byggår",2026]
[null,"Krav minskad klimatpåverkan (%)"]
[null,"Minskad klimatpåverkan enl. Kalkyl (%)",{"$f":"'Förenklad klimatkalkyl'!Q45","v":""}]
[null,"Underlag mängder"]
[null,"Datum på underlag"]
[null,"Investeringskostnad (kr)"]
[null,"Prisnivå"]
[null,"Klimatpåverkan per investerad kr (kg CO2ekv / kr). Gemensamma miljökrav",{"$f":"IF(SUM(C9*'Förenklad klimatkalkyl'!J45=0),\" \",'Förenklad klimatkalkyl'!J45/Projektinformation!C9)","v":" "}]
[null,"Kort beskrivning av åtgärd"]

{"sheet":"Förenklad klimatkalkyl","index":2,"n_rows":45,"n_cols":19,"rows_kept":45,"cut":false,"hidden":false,"merged":[[4,17,4,18],[60,3,60,6],[4,8,4,9],[4,11,4,14],[4,15,4,16],[4,2,4,7]]}
[]
[]
[]
[null,"malldatum: 2026-04-22"]
[null,null,"Referenskalkyl",null,null,null,null,null,"Gemensamma miljökrav",null,null,"Utgångsläge entreprenad (klimatförbättrat alternativ)",null,null,null,"Skillnad klimatpåverkan %",null,"Skillnad klimatpåverkan [kg Co2-ekv]"]
["Materialtyp","Material","Tjocklek [mm] (Endast asfalt)","Mängd","Enhet","Emissionsfaktor A1-A3 [kg CO2e/kg] ","Transportavstånd [km]","Klimatpåverkan [kg CO2e]","Emissionsfaktor A1-A3 [kg CO2e/kg] ","Klimatpåverkan [kg CO2e]","Tjocklek [mm] (Endast asfalt)","Mängd","Emissionsfaktor A1-A3 [kg CO2e/kg] ","Transportavstånd [km]","Klimatpåverkan [kg CO2e]","Ref alt / gem miljökr.","Ref alt / klimatförb alt.","Ref alt / gem miljökr.","Ref alt / klimatförb alt."]
["Betong","Betong Generellt värde (C35/45 samt XD3, XS3 och XF4)",null,null,"m3",0.16400000000000001,35,{"$f":"($D$7*Standardvärden!C2*'Förenklad klimatkalkyl'!$F$7)+(Standardvärden!$D$8*'Förenklad klimatkalkyl'!$D$7*G7)","v":0},0.13200000000000001,{"$f":"($D7*Standardvärden!$C$2*'Förenklad klimatkalkyl'!$I$7)+(Standardvärden!$D$8*'Förenklad klimatkalkyl'!$D7*$G7)","v":0},null,{"$f":"D7","v":0},{"$f":"I7","v":0.13200000000000001},{"$f":"G7","v":35},{"$f":"IF(SUM(L7*M7*N7)=0,\"Fyll i värde L-N\",($L$7*Standardvärden!C2*'Förenklad klimatkalkyl'!$M$7)+(Standardvärden!$D$8*'Förenklad klimatkalkyl'!$L$7*N7))","v":"Fyll i värde L-N"},{"$f":"IFERROR(-(H7-J7)/H7,\"\")","v":""},{"$f":"IFERROR(-((H7-O7)/H7),\"\")","v":""},{"$f":"-(H7-J7)","v":0},{"$f":"IFERROR(-(H7-O7),\"\")","v":""}]
["Betong","Betong (C40/50 samt XD3)",null,null,"m3",0.161,35,{"$f":"($D$8*Standardvärden!C2*'Förenklad klimatkalkyl'!$F$8)+(Standardvärden!$D$8*'Förenklad klimatkalkyl'!$D$8*G8)","v":0},0.13200000000000001,{"$f":"($D8*Standardvärden!$C$2*'Förenklad klimatkalkyl'!$I$8)+(Standardvärden!$D$8*'Förenklad klimatkalkyl'!$D8*$G8)","v":0},null,{"$f":"D8","v":0},{"$f":"I8","v":0.13200000000000001},35,{"$f":"IF(SUM(L8*M8*N8)=0,\"Fyll i värde L-N\",($L$8*Standardvärden!C2*'Förenklad klimatkalkyl'!$M$8)+(Standardvärden!$D$8*'Förenklad klimatkalkyl'!$L$8*N8))","v":"Fyll i värde L-N"},"","",{"$f":"-(H8-J8)","v":0},{"$f":"IFERROR(-(H8-O8),\"\")","v":""}]
["Betong","Betong (C32/40 samt XD2, XS2 och XF2)",null,null,"m3",0.151,35,{"$f":"($D$9*Standardvärden!C2*'Förenklad klimatkalkyl'!$F$9)+(Standardvärden!$D$8*'Förenklad klimatkalkyl'!$D$9*G9)","v":0},0.121,{"$f":"($D9*Standardvärden!$C$2*'Förenklad klimatkalkyl'!$I$9)+(Standardvärden!$D$8*'Förenklad klimatkalkyl'!$D9*$G9)","v":0},null,0,{"$f":"I9","v":0.121},35,{"$f":"IF(SUM(L9*M9*N9)=0,\"Fyll i värde L-N\",($L$9*Standardvärden!C2*'Förenklad klimatkalkyl'!$M$9)+(Standardvärden!$D$8*'Förenklad klimatkalkyl'!$L$9*N9))","v":"Fyll i värde L-N"},"","",0,""]
["Anläggningssten","Kantstöd (Beteckning:RV4, BxH:100x300 mm)",null,null,"m",0.05,440,{"$f":"$D$10*Standardvärden!C37*('Förenklad klimatkalkyl'!$F$10*0.3*0.1)+(Standardvärden!E54*('Förenklad klimatkalkyl'!$D$10*0.3*0.1)*G10)","v":0},"saknas",{"$f":"H10","v":0},null,0,{"$f":"F10","v":0.05},440,{"$f":"IF(SUM(L10*M10*N10)=0,\"Fyll i värde L-N\",IF(E10=\"m\",($L$10*Standardvärden!C37*('Förenklad klimatkalkyl'!$M$10*0.3*0.1))+(Standardvärden!E54*('Förenklad klimatkalkyl'!$L$10*0.3*0.1)*N10),))","v":"Fyll i värde L-N"},{"$f":"IFERROR(-(H10-J10)/H10,\"\")","v":""},"",0,""]
["Anläggningssten","Smågatsten (BxH:90 x 90 mm)",null,null,"m2",0.05,440,{"$f":"IF(E11=\"m\",($D$11*Standardvärden!C37*('Förenklad klimatkalkyl'!$F$11*0.09*0.09))+(Standardvärden!E54*('Förenklad klimatkalkyl'!$D$11*0.09*0.09)*G11),(IF(E11=\"m2\",($D$11*Standardvärden!C37*('Förenklad klimatkalkyl'!$F$11*0.09))+(Standardvärden!E54*('Förenklad klimatkalkyl'!$D$11*0.09)*G11),0)))","v":0},"saknas",{"$f":"H11","v":0},null,0,{"$f":"F11","v":0.05},440,{"$f":"IF(SUM(L11*M11*N11)=0,\"Fyll i värde L-N\",IF(E11=\"m\",($L$11*Standardvärden!C37*('Förenklad klimatkalkyl'!$M$11*0.09*0.09))+(Standardvärden!E54*('Förenklad klimatkalkyl'!$L$11*0.09*0.09)*N11),(IF(E11=\"m2\",($L$11*Standardvärden!C37*('Förenklad klimatkalkyl'!$M$11*0.09))+(Standardvärden!E54*('Förenklad klimatkalkyl'!$L$11*0.09)*N11),0))))","v":"Fyll i värde L-N"},{"$f":"IFERROR(-(H11-J11)/H11,\"\")","v":""},"",0,""]
["Anläggningssten","Storgatsten (BxH:140 x 140 mm)",null,null,"m2",0.05,440,{"$f":"IF(E12=\"m\",($D$12*Standardvärden!C37*('Förenklad klimatkalkyl'!$F$12*0.14*0.14))+(Standardvärden!E54*('Förenklad klimatkalkyl'!$D$12*0.14*0.14)*G12),(IF(E12=\"m2\",($D$12*Standardvärden!C37*('Förenklad klimatkalkyl'!$F$12*0.14))+(Standardvärden!E54*('Förenklad klimatkalkyl'!$D$12*0.14)*G12),0)))","v":0},"saknas",{"$f":"H12","v":0},null,0,{"$f":"F12","v":0.05},440,{"$f":"IF(SUM(L12*M12*N12)=0,\"Fyll i värde L-N\",IF(E12=\"m\",($L$12*Standardvärden!C37*('Förenklad klimatkalkyl'!$M$12*0.14*0.14))+(Standardvärden!E54*('Förenklad klimatkalkyl'!$L$12*0.14*0.14)*N12),(IF(E12=\"m2\",($L$12*Standardvärden!C37*('Förenklad klimatkalkyl'!$M$12*0.14))+(Standardvärden!E54*('Förenklad klimatkalkyl'!$L$12*0.14)*N12),0))))","v":"Fyll i värde L-N"},"","",0,""]
["Anläggningssten","Naturstensplattor (Tjocklek 120 mm)",null,null,"m2",0.05,440,{"$f":"($D$13*Standardvärden!C37*('Förenklad klimatkalkyl'!$F$13*0.12))+(Standardvärden!E54*('Förenklad klimatkalkyl'!$D$13*0.12)*G13)","v":0},"saknas",{"$f":"H13","v":0},null,0,{"$f":"F13","v":0.05},440,{"$f":"IF(SUM(L13*M13*N13)=0,\"Fyll i värde L-N\",($L$13*Standardvärden!C37*('Förenklad klimatkalkyl'!$M$13*0.12))+(Standardvärden!E54*('Förenklad klimatkalkyl'!$L$13*0.12)*N13))","v":"Fyll i värde L-N"},"","",0,""]
["Anläggningssten","Anläggningssten, generellt värde",null,null,"m3",0.05,440,{"$f":"($D$14*Standardvärden!C37*'Förenklad klimatkalkyl'!$F$14)+(Standardvärden!E54*'Förenklad klimatkalkyl'!$D$14*G14)","v":0},"saknas",{"$f":"H14","v":0},null,0,{"$f":"F14","v":0.05},440,{"$f":"IF(SUM(L14*M14*N14)=0,\"Fyll i värde L-N\",($L$14*Standardvärden!C37*'Förenklad klimatkalkyl'!$M$14)+(Standardvärden!E54*'Förenklad klimatkalkyl'!$L$14*N14))","v":"Fyll i värde L-N"},"","",0,""]
["Stål","Stål, armering, slakarmering",null,null,"ton",0.52,840,{"$f":"(D15*Standardvärden!$C$11*'Förenklad klimatkalkyl'!F15)+(Standardvärden!$E$33*'Förenklad klimatkalkyl'!D15*G15)","v":0},0.52,{"$f":"(D15*Standardvärden!$C$11*'Förenklad klimatkalkyl'!I15)+(Standardvärden!$E$33*'Förenklad klimatkalkyl'!D15*G15)","v":0},null,0,{"$f":"I15","v":0.52},840,{"$f":"IF(SUM(L15*M15*N15)=0,\"Fyll i värde L-N\",(L15*Standardvärden!$C$11*'Förenklad klimatkalkyl'!M15)+(Standardvärden!$E$33*'Förenklad klimatkalkyl'!L15*N15))","v":"Fyll i värde L-N"},"","",0,""]
{"$rows_left_out":31}
{"sheet":"Arbetsmoment arbetsplatsen","index":3,"n_rows":29,"n_cols":17,"rows_kept":29,"cut":false,"hidden":false,"merged":[[21,0,21,4],[18,13,18,16],[0,6,0,10],[0,0,0,4],[7,0,7,4],[11,0,11,4],[16,0,16,4]]}
["Asfaltsutläggning ",null,null,null,null,null,"Lastbil regiontransport för fall B massor",null,null,null,null,null,null,"Emmisionsfaktorer alternativa drivmedel","kg CO2e/l dieselekvivalenter"]
["Antal utläggningar m2",null,null,1,"st/m2",null,"Dieselförbrukning",null,null,1.5,"MJ/tkm",null,null,"Drivmedel","Emissionsfaktor"]
["Antal utläggningar ton",null,null,7.4,"st/ton",null,"Drivmedel klimatförbättrat alt.",null,null,"Gemensamma miljökrav",null,null,null,"Biogas",0.6]
["Dieselförbrukning",null,null,9.64E-2,"l/st",null,"Emissionsfaktor drivmedel",null,null,{"$f":"VLOOKUP(J3,N3:O16,2)","v":1.113},"kg CO2e/l",null,null,"Diesel",2.8]
["Diesel ekv per m2",null,null,{"$f":"D2*D4","v":9.64E-2},"l/m2",null,"Transportlängd fall B schablon",null,null,30,"km",null,null,"E85",1.72]
["Drivmedel klimatförbättrat alt.",null,null,"Gemensamma miljökrav",null,null,"Just. transportlängd Bergschakt",null,null,30,"km",null,null,"ED95",1]
["Emissionsfaktor drivmedel",null,null,{"$f":"VLOOKUP(D6,N3:O17,2)","v":1.113},"kg CO2e/l",null,"Just. transportlängd Berg Fyll",null,null,30,"km",null,null,"Egen emissionsfaktor",null,null,"Kan fyllas i för beräkning med andel av olika drivmedel"]
["Grävmaskin",null,null,null,null,null,"Just. transportlängd Jordschakt",null,null,30,"km",null,null,"El (residual)",0.19]
["Dieselförbrukning",null,null,0.18611309949892599,"l/m3",null,"Just. transportlängd Jord fyll",null,null,30,"km",null,null,"El (ursprungsmärkt förnybar)",0.04]
["Drivmedel klimatförbättrat alt.",null,null,"Gemensamma miljökrav",null,null,null,"Dumper Fall A massor",null,null,null,null,null,"FAME",1.1000000000000001]
["Emissionsfaktor drivmedel",null,null,{"$f":"VLOOKUP(D10,N3:O15,2)","v":1.113},"kg CO2e/l",null,"Dieselförbrukning",null,null,6.27,"MJ/tkm",null,null,"Fordonsgas",0.89]
["Krossning mobilt verk",null,null,null,null,null,"Drivmedel klimatförbättrat alt.",null,null,"Gemensamma miljökrav",null,null,null,"Gemensamma miljökrav",{"$f":"VLOOKUP(Projektinformation!C4,'Arbetsmoment arbetsplatsen'!N20:P27,3)","v":1.113}]
["Energiåtgång krossning",null,null,71.082082277246997,"MJ/m3",null,"Emissionsfaktor drivmedel",null,null,{"$f":"VLOOKUP(J12,N3:O16,2)","v":1.113},"kg CO2e/l",null,null,"HVO 100",0.39]
["Inverterat värmevärde Diesel",null,null,2.8344999999999999E-2,"l/MJ",null,"Transportlängd fall A schablon",null,null,2,"km",null,null,"LNG/LBG",3.48]
["Drivmedel klimatförbättrat alt.",null,null,"Gemensamma miljökrav",null,null,"Just. Transportlängd Bergschakt",null,null,2,"km",null,null,"Vätgas i bränslecell (förnybar från biomassa)",1.1200000000000001]
{"$rows_left_out":15}
{"sheet":"Resultat","index":4,"n_rows":41,"n_cols":19,"rows_kept":41,"cut":false,"hidden":false,"merged":[]}
["Andel av totala Klimatpåverkan som respektive matrialtyp står för i de olika alternativen"]
["Materialtyp","Andel - referenskalkyl","Andel - gemensamma miljökrav","Andel - klimatförbättrat alternativ",null,null,null,null,null,null,null,null,null,null,null,null,null,"Materialtyp","Andel - referenskalkyl"]
["Anläggningssten",{"$error":"#DIV/0!"},{"$error":"#DIV/0!"},{"$error":"#DIV/0!"},null,null,null,null,null,null,null,null,null,null,null,null,null,"Anläggningssten",{"$error":"#DIV/0!"}]
["Asfalt",{"$error":"#DIV/0!"},{"$error":"#DIV/0!"},{"$error":"#DIV/0!"},null,null,null,null,null,null,null,null,null,null,null,null,null,"Asfalt",{"$error":"#DIV/0!"}]
["Bergmassor",{"$error":"#DIV/0!"},{"$error":"#DIV/0!"},{"$error":"#DIV/0!"},null,null,null,null,null,null,null,null,null,null,null,null,null,"Bergmassor",{"$error":"#DIV/0!"}]
["Betong",{"$error":"#DIV/0!"},{"$error":"#DIV/0!"},{"$error":"#DIV/0!"},null,null,null,null,null,null,null,null,null,null,null,null,null,"Betong",{"$error":"#DIV/0!"}]
["Jordmassor",{"$error":"#DIV/0!"},{"$error":"#DIV/0!"},{"$error":"#DIV/0!"},null,null,null,null,null,null,null,null,null,null,null,null,null,"Jordmassor",{"$error":"#DIV/0!"}]
["Ledning av plaströr",{"$error":"#DIV/0!"},{"$error":"#DIV/0!"},{"$error":"#DIV/0!"},null,null,null,null,null,null,null,null,null,null,null,null,null,"Ledning av plaströr",{"$error":"#DIV/0!"}]
["Stål",{"$error":"#DIV/0!"},{"$error":"#DIV/0!"},{"$error":"#DIV/0!"},null,null,null,null,null,null,null,null,null,null,null,null,null,"Stål",{"$error":"#DIV/0!"}]
["Lättfyllnad",{"$error":"#DIV/0!"},{"$error":"#DIV/0!"},{"$error":"#DIV/0!"},null,null,null,null,null,null,null,null,null,null,null,null,null,"Lättfyllnad",{"$error":"#DIV/0!"}]
["Stödmur",{"$error":"#DIV/0!"},{"$error":"#DIV/0!"},{"$error":"#DIV/0!"},null,null,null,null,null,null,null,null,null,null,null,null,null,"Stödmur",{"$error":"#DIV/0!"}]
["Grand Total",{"$error":"#DIV/0!"},{"$error":"#DIV/0!"},{"$error":"#DIV/0!"},null,null,null,null,null,null,null,null,null,null,null,null,null,"Grand Total",{"$error":"#DIV/0!"}]
[]
[null,null,null,null,null,null,null,null,null,null,null,null,null,null,null,null,null,"Materialtyp","Andel - gemensamma miljökrav"]
[null,null,null,null,null,null,null,null,null,null,null,null,null,null,null,null,null,"Anläggningssten",{"$error":"#DIV/0!"}]
{"$rows_left_out":27}
{"sheet":"Resultat per materialtyp","index":5,"n_rows":133,"n_cols":12,"rows_kept":133,"cut":false,"hidden":false,"merged":[]}
[null,"Jämförelse av klimatpåverkan  [kg CO2e] per materialtyp för respektive alternativ"]
[]
[null,null,null,null,null,null,null,null,"Materialtyp","Referenskalkyl","Med gemensamma miljökrav","Utgångsläge entreprenad"]
[null,null,null,null,null,null,null,null,"Anläggningssten",0,0,0]
[null,null,null,null,null,null,null,null,"Grand Total",0,0,0]
[]
[]
[]
[]
[]
[]
[]
[]
[]
[]
{"$rows_left_out":119}
{"sheet":"Standardvärden","index":6,"n_rows":63,"n_cols":32,"rows_kept":63,"cut":false,"hidden":false,"merged":[[39,18,39,20],[29,9,29,10],[0,15,0,27],[1,15,1,27],[12,16,12,18],[12,24,12,26],[39,26,39,28]]}
[null,"Betong",null,null,null,null,null,null,"Asfalt",null,null,null,null,null,null,"Gemensamma miljökrav 2024 ver 2.0"]
[null,"kg -> m3",2350,null,null,null,null,null,null,"Densitet",null,null,null,null,null,"Maximalt utsläpp (kg CO2ekv/kg)"]
[null,"MJ/tkm",2.5,null,null,null,null,null,"Abb",112.15,null,null,null,null,null,"Årtal","ABT","ABT PMB","ABS","ABS PMB","ABb","ABb PMB","AG","AG PMB","MJAG","MJOG","TSK","PGJA"]
[null,"kg CO2e/l",2.8,null,null,null,null,null,"ABS",89.72,null,null,null,null,null,2024,3.4000000000000002E-2,0.04,0.04,4.4999999999999998E-2,0.03,3.5999999999999997E-2,2.8000000000000001E-2,3.4000000000000002E-2]
[null,"l/MJ",2.8344999999999999E-2,null,null,null,null,null,"ABT",89.72,null,null,null,null,null,2025,2.5999999999999999E-2,3.4000000000000002E-2,0.03,3.7999999999999999E-2,2.5999999999999999E-2,3.1E-2,2.4E-2,2.9000000000000001E-2,2.1999999999999999E-2,2.1999999999999999E-2]
[null,"kg -> ton",1E-3,null,null,null,null,null,"AG",134.58000000000001,null,null,null,null,null,2026,2.5999999999999999E-2,3.4000000000000002E-2,0.03,3.7999999999999999E-2,2.5999999999999999E-2,3.1E-2,2.4E-2,2.9000000000000001E-2,2.1999999999999999E-2,2.1999999999999999E-2]
["för 1 km","Omräkning kg CO2/m3",null,{"$f":"(1*1*Standardvärden!C2*Standardvärden!C6*C3*C4*C5)","v":0.46627524999999997},null,null,null,null,"MJAG/MJOG",112.15,null,null,null,null,null,2027,2.4E-2,3.2000000000000001E-2,2.7E-2,3.5999999999999997E-2,2.4E-2,2.8000000000000001E-2,2.1999999999999999E-2,2.7E-2,1.9E-2,1.9E-2]
["för 1 km","Summa transport kg CO2/m3",null,{"$f":"D7","v":0.46627524999999997},null,null,null,null,"ABb","Omräkning kg CO2/m3",null,null,{"$f":"(Standardvärden!K20*Standardvärden!$M$15*Standardvärden!$M$16*Standardvärden!$M$18)","v":1.335134535E-2},"för 1 km",null,2028,2.4E-2,3.2000000000000001E-2,2.7E-2,3.5999999999999997E-2,2.4E-2,2.8000000000000001E-2,2.1999999999999999E-2,2.7E-2,1.9E-2,1.9E-2]
[null,null,null,null,null,null,null,null,"ABS","Omräkning kg CO2/m3",null,null,{"$f":"(Standardvärden!K21*Standardvärden!$M$15*Standardvärden!$M$16*Standardvärden!$M$18)","v":1.0681076279999998E-2},null,null,2029,2.4E-2,3.2000000000000001E-2,2.7E-2,3.5999999999999997E-2,2.4E-2,2.8000000000000001E-2,2.1999999999999999E-2,2.7E-2,1.9E-2,1.9E-2]
[null,"Stål",null,null,null,null,null,null,"ABT","Omräkning kg CO2/m3",null,null,{"$f":"(Standardvärden!K22*Standardvärden!$M$15*Standardvärden!$M$16*Standardvärden!$M$18)","v":1.0681076279999998E-2},null,null,2030,1.9E-2,2.9000000000000001E-2,2.4E-2,3.3000000000000002E-2,2.1999999999999999E-2,2.5999999999999999E-2,0.02,2.5000000000000001E-2,1.6E-2,1.6E-2]
[null,"ton -> kg",1000,null,null,null,null,null,"AG","Omräkning kg CO2/m3",null,null,{"$f":"(Standardvärden!K23*Standardvärden!$M$15*Standardvärden!$M$16*Standardvärden!$M$18)","v":1.6021614419999997E-2}]
[null,"Lastbil Landsväg",null,300,null,null,null,null,"MJAG/MJOG","Omräkning kg CO2/m3",null,null,{"$f":"(Standardvärden!K24*Standardvärden!$M$15*Standardvärden!$M$16*Standardvärden!$M$18)","v":1.335134535E-2},null,null,null,"Lättfyllnad XPS",null,null,null,null,null,null,null,"Lättfyllnad Skumglas"]
[null,"Lastbil närdistr.",null,40,null,null,null,null,"Generellt","Omräkning kg CO2/m3",null,null,{"$f":"(Standardvärden!$M$15*Standardvärden!$M$16*Standardvärden!$M$18)","v":0.11904899999999997},null,null,null,"Omvandlignsfaktorer",null,null,null,"landsväg",800,null,null,"Omvandlignsfaktorer",null,null,null,"landsväg",300]
[null,"Järnväg",null,500,null,null,null,null,null,null,null,null,null,null,null,"Densitet XPS",null,30,"kg/m3",null,"närdistr",40,null,"Densitet ",null,180,"kg/m3",null,"närdistr",40]
[null,"Omräkningar transport landsväg",null,null,null,null,null,null,null,null,null,"MJ/tkm",1.5,null,null,null,"kg -> ton",1E-3,null,null,null,null,null,null,"kg -> ton",1E-3]
{"$rows_left_out":48}